Test key

 Using addons-installer>=1.2.2
17 jobs for master in 2 minutes and 28 seconds (queued for 6 seconds)
Name Stage Failure
failed
test_python:3.10 Test
?  ^ ^^


----------------------------------------------------------------------
Ran 82 tests in 0.010s

FAILED (failures=1)
Cleaning up file based variables
ERROR: Job failed: command terminated with exit code 1
failed
test_python:2.7 Test
('enable odoo_filestore_s3 ?', False, 'False')
('enable odoo_session_redis ? ', False, 'False')
('enable odoo_filestore_s3 ?', True, 'True')
('enable odoo_session_redis ? ', False, 'False')
('enable odoo_filestore_s3 ?', True, 'True')
('enable odoo_session_redis ? ', False, 'False')
[u'--config=/tmp/odoo_rc.conf', '--save', '--stop-after-init', u'--addons-path=/odoo/odoo/addons,/opt/addons/cloud_modules,/odoo/addons,/opt/addons/local_src,/opt/addons/community_addons,/opt/addons/common_modules', u'--workers=4', u'--max-cron-threads=2', u'--http-interface=0.0.0.0', u'--http-port=8080', u'--longpolling-port=8072', u'--db_host=localhost', u'--db_port=5432', u'--db_user=odoo', u'--db_password=odoo', u'--database=test_db', '--no-database-list', u'--db_maxconn=9', u'--db-filter=test_db', u'--load=base,web,queue_job,odoo_filestore_s3', '--unaccent']
Cleaning up file based variables
ERROR: Job failed: command terminated with exit code 1
failed
test_python:latest Test
?  ^ ^^


----------------------------------------------------------------------
Ran 82 tests in 0.010s

FAILED (failures=1)
Cleaning up file based variables
ERROR: Job failed: command terminated with exit code 1
failed
test_python:3.7 Test
enable odoo_filestore_s3 ? False False
enable odoo_session_redis ? False False
enable odoo_filestore_s3 ? True True
enable odoo_session_redis ? False False
enable odoo_filestore_s3 ? True True
enable odoo_session_redis ? False False
['--config=/tmp/odoo_rc.conf', '--save', '--stop-after-init', '--addons-path=/opt/addons/common_modules,/opt/addons/cloud_modules,/opt/addons/local_src,/odoo/odoo/addons,/opt/addons/community_addons,/odoo/addons', '--workers=4', '--max-cron-threads=2', '--http-interface=0.0.0.0', '--http-port=8080', '--longpolling-port=8072', '--db_host=localhost', '--db_port=5432', '--db_user=odoo', '--db_password=odoo', '--database=test_db', '--no-database-list', '--db_maxconn=9', '--db-filter=test_db', '--load=base,web,queue_job,odoo_filestore_s3', '--unaccent']
Cleaning up file based variables
ERROR: Job failed: command terminated with exit code 1
failed
test_python:3.9 Test
?  ^ ^^


----------------------------------------------------------------------
Ran 82 tests in 0.012s

FAILED (failures=1)
Cleaning up file based variables
ERROR: Job failed: command terminated with exit code 1
failed
test_python:3.6 Test
?  ^ ^^


----------------------------------------------------------------------
Ran 82 tests in 0.012s

FAILED (failures=1)
Cleaning up file based variables
ERROR: Job failed: command terminated with exit code 1
failed
test_python:3.8 Test
?  ^ ^^


----------------------------------------------------------------------
Ran 82 tests in 0.010s

FAILED (failures=1)
Cleaning up file based variables
ERROR: Job failed: command terminated with exit code 1
failed
test_pypi_python:2.7 Test
  <h1>403 Invalid or non-existent authentication information. See https://test.pypi.org/help/#invalid-auth for more information.</h1>
Access was denied to this resource.<br/><br/>
Invalid or non-existent authentication information. See https://test.pypi.org/help/#invalid-auth for more information.


</body>
</html>
Cleaning up file based variables
ERROR: Job failed: command terminated with exit code 1
failed
test_pypi_python:latest Test
Invalid or non-existent authentication information. See https://test.pypi.org/help/#invalid-auth for more information.


</body>
</html>
HTTPError: 403 Forbidden from https://test.pypi.org/legacy/
Invalid or non-existent authentication information. See https://test.pypi.org/help/#invalid-auth for more information.
Cleaning up file based variables
ERROR: Job failed: command terminated with exit code 1